Target
Platelet-activating factor receptor
Ligand
BDBM50038809
Substrate
Meas. Tech.
ChEMBL_151699 (CHEMBL760448)
Ki
0.800000±n/a nM
Citation
 Sheppard, GSPireh, DCarrera, GMBures, MGHeyman, HRSteinman, DHDavidsen, SKPhillips, JGGuinn, DEMay, PD 3-(2-(3-Pyridinyl)thiazolidin-4-oyl)indoles, a novel series of platelet activating factor antagonists. J Med Chem 37:2011-32 (1994)  
Target
Name:
Platelet-activating factor receptor
Synonyms:
PAF-R PTAFR_CAVPO Platelet-activating factor receptor
Type:
Protein
Mol. Mass.:
39005.63
Organism:
Cavia porcellus
Description:
Residue:
342
  
Inhibitor
Name:
BDBM50038809
Synonyms:
3-((R)-2-Pyridin-3-yl-thiazolidine-4-carbonyl)-indole-1-carboxylic acid dimethylamide | CHEMBL64057
Type:
Small organic molecule
Emp. Form.:
C20H20N4O2S
Mol. Mass.:
380.463
SMILES:
CN(C)C(=O)n1cc(C(=O)[C@@H]2CSC(N2)c2cccnc2)c2ccccc12
: