Target
Platelet-activating factor receptor
Ligand
BDBM50038819
Substrate
Meas. Tech.
ChEMBL_151699 (CHEMBL760448)
Ki
1.5±n/a nM
Citation
 Sheppard, GSPireh, DCarrera, GMBures, MGHeyman, HRSteinman, DHDavidsen, SKPhillips, JGGuinn, DEMay, PD 3-(2-(3-Pyridinyl)thiazolidin-4-oyl)indoles, a novel series of platelet activating factor antagonists. J Med Chem 37:2011-32 (1994)  
Target
Name:
Platelet-activating factor receptor
Synonyms:
PAF-R PTAFR_CAVPO Platelet-activating factor receptor
Type:
Protein
Mol. Mass.:
39005.63
Organism:
Cavia porcellus
Description:
Residue:
342
  
Inhibitor
Name:
BDBM50038819
Synonyms:
CHEMBL64464 | Morpholin-4-yl-[3-((R)-2-pyridin-3-yl-thiazolidine-4-carbonyl)-indol-1-yl]-methanone
Type:
Small organic molecule
Emp. Form.:
C22H22N4O3S
Mol. Mass.:
422.5
SMILES:
O=C([C@@H]1CSC(N1)c1cccnc1)c1cn(C(=O)N2CCOCC2)c2ccccc12
: