Target
Platelet-activating factor receptor
Ligand
BDBM50038777
Substrate
Meas. Tech.
ChEMBL_151699 (CHEMBL760448)
Ki
1.1±n/a nM
Citation
 Sheppard, GSPireh, DCarrera, GMBures, MGHeyman, HRSteinman, DHDavidsen, SKPhillips, JGGuinn, DEMay, PD 3-(2-(3-Pyridinyl)thiazolidin-4-oyl)indoles, a novel series of platelet activating factor antagonists. J Med Chem 37:2011-32 (1994)  
Target
Name:
Platelet-activating factor receptor
Synonyms:
PAF-R PTAFR_CAVPO Platelet-activating factor receptor
Type:
Protein
Mol. Mass.:
39005.63
Organism:
Cavia porcellus
Description:
Residue:
342
  
Inhibitor
Name:
BDBM50038777
Synonyms:
(7-Benzyloxy-1H-indol-3-yl)-((R)-2-pyridin-3-yl-thiazolidin-4-yl)-methanone; TFA | CHEMBL60081
Type:
Small organic molecule
Emp. Form.:
C24H21N3O2S
Mol. Mass.:
415.507
SMILES:
O=C([C@@H]1CSC(N1)c1cccnc1)c1c[nH]c2c(OCc3ccccc3)cccc12
: