Target
Sodium-dependent dopamine transporter
Ligand
BDBM50039170
Substrate
Meas. Tech.
ChEMBL_49345 (CHEMBL662482)
IC50
630±n/a nM
Citation
 Kline, RHEshleman, AJWright, JEldefrawi, ME Synthesis of substituted 3-carbamoylecgonine methyl ester analogues: irreversible and photoaffinity ligands for the cocaine receptor/dopamine transporter. J Med Chem 37:2249-52 (1994)  
Target
Name:
Sodium-dependent dopamine transporter
Synonyms:
DA transporter SC6A3_RAT Sodium-dependent dopamine transporter | Sodium-dependent dopamine transporter (DAT)
Type:
Multi-pass membrane protein
Mol. Mass.:
68749.45
Organism:
Rattus norvegicus (rat)
Description:
P23977
Residue:
619
  
Inhibitor
Name:
BDBM50039170
Synonyms:
(R)-3-(3-Azido-phenylcarbamoyloxy)-8-methyl-8-aza-bicyclo[3.2.1]octane-2-carboxylic acid methyl ester | CHEMBL309180
Type:
Small organic molecule
Emp. Form.:
C17H21N5O4
Mol. Mass.:
359.3797
SMILES:
COC(=O)C1C2CC[C@H](CC1OC(=O)Nc1cccc(c1)N=[N+]=[N-])N2C
: