Target
Glyceraldehyde-3-phosphate dehydrogenase
Ligand
BDBM50368901
Substrate
Meas. Tech.
ChEMBL_72880 (CHEMBL684048)
IC50
6000±n/a nM
Citation
 Verlinde, CLCallens, MVan Calenbergh, SVan Aerschot, AHerdewijn, PHannaert, VMichels, PAOpperdoes, FRHol, WG Selective inhibition of trypanosomal glyceraldehyde-3-phosphate dehydrogenase by protein structure-based design: toward new drugs for the treatment of sleeping sickness. J Med Chem 37:3605-13 (1994)  
Target
Name:
Glyceraldehyde-3-phosphate dehydrogenase
Synonyms:
G3P_HUMAN GAPDH | Glyceraldehyde-3-phosphate dehydrogenase liver
Type:
PROTEIN
Mol. Mass.:
36060.86
Organism:
Homo sapiens (Human)
Description:
ChEMBL_1511315
Residue:
335
  
Inhibitor
Name:
BDBM50368901
Synonyms:
CHEMBL608348
Type:
Small organic molecule
Emp. Form.:
C11H15N5O4
Mol. Mass.:
281.2679
SMILES:
Cc1nc(N)c2ncn(C3O[C@H](CO)[C@@H](O)[C@H]3O)c2n1
: