Target
Glyceraldehyde-3-phosphate dehydrogenase
Ligand
BDBM50422031
Substrate
Meas. Tech.
ChEMBL_72890 (CHEMBL684057)
IC50
10000±n/a nM
Citation
 Verlinde, CLCallens, MVan Calenbergh, SVan Aerschot, AHerdewijn, PHannaert, VMichels, PAOpperdoes, FRHol, WG Selective inhibition of trypanosomal glyceraldehyde-3-phosphate dehydrogenase by protein structure-based design: toward new drugs for the treatment of sleeping sickness. J Med Chem 37:3605-13 (1994)  
Target
Name:
Glyceraldehyde-3-phosphate dehydrogenase
Synonyms:
G3P_HUMAN GAPDH | Glyceraldehyde-3-phosphate dehydrogenase liver
Type:
PROTEIN
Mol. Mass.:
36060.86
Organism:
Homo sapiens (Human)
Description:
ChEMBL_1511315
Residue:
335
  
Inhibitor
Name:
BDBM50422031
Synonyms:
8-Phenyladenosine | CHEMBL1775010
Type:
Small organic molecule
Emp. Form.:
C16H17N5O4
Mol. Mass.:
343.3373
SMILES:
Nc1ncnc2n([C@@H]3O[C@H](CO)[C@@H](O)[C@H]3O)c(nc12)-c1ccccc1
: