Target
Glyceraldehyde-3-phosphate dehydrogenase
Ligand
BDBM14487
Substrate
Meas. Tech.
ChEMBL_72902 (CHEMBL684096)
IC50
35000±n/a nM
Citation
 Verlinde, CLCallens, MVan Calenbergh, SVan Aerschot, AHerdewijn, PHannaert, VMichels, PAOpperdoes, FRHol, WG Selective inhibition of trypanosomal glyceraldehyde-3-phosphate dehydrogenase by protein structure-based design: toward new drugs for the treatment of sleeping sickness. J Med Chem 37:3605-13 (1994)  
Target
Name:
Glyceraldehyde-3-phosphate dehydrogenase
Synonyms:
G3P_HUMAN GAPDH | Glyceraldehyde-3-phosphate dehydrogenase liver
Type:
PROTEIN
Mol. Mass.:
36060.86
Organism:
Homo sapiens (Human)
Description:
ChEMBL_1511315
Residue:
335
  
Inhibitor
Name:
BDBM14487
Synonyms:
(2R,3R,4S,5R)-2-(6-amino-9H-purin-9-yl)-5-(hydroxymethyl)oxolane-3,4-diol Adenosine N6-Methylado cid_191 | cid_60961
Type:
Nucleoside or nucleotide
Emp. Form.:
C10H13N5O4
Mol. Mass.:
267.2413
SMILES:
Nc1ncnc2n(cnc12)[C@@H]1O[C@H](CO)[C@@H](O)[C@H]1O
: