Target
Neutral alpha-glucosidase C
Ligand
BDBM50407255
Substrate
Meas. Tech.
ChEMBL_34407 (CHEMBL647805)
IC50
5800±n/a nM
Citation
 Asano, NOseki, KKizu, HMatsui, K Nitrogen-in-the-ring pyranoses and furanoses: structural basis of inhibition of mammalian glycosidases. J Med Chem 37:3701-6 (1994)  
Target
Name:
Neutral alpha-glucosidase C
Synonyms:
GANC_MOUSE | Ganc
Type:
PROTEIN
Mol. Mass.:
102002.29
Organism:
Mus musculus
Description:
ChEMBL_34410
Residue:
898
  
Inhibitor
Name:
BDBM50407255
Synonyms:
CHEMBL2114189
Type:
Small organic molecule
Emp. Form.:
C6H13NO2
Mol. Mass.:
131.1729
SMILES:
CC[C@H]1NC[C@@H](O)[C@@H]1O
: