Target
Sodium-dependent dopamine transporter
Ligand
BDBM50084717
Substrate
Meas. Tech.
ChEMBL_62176 (CHEMBL672115)
IC50
405±n/a nM
Citation
 Kelkar, SVIzenwasser, SKatz, JLKlein, CLZhu, NTrudell, ML Synthesis, cocaine receptor affinity, and dopamine uptake inhibition of several new 2 beta-substituted 3 beta-phenyltropanes. J Med Chem 37:3875-7 (1994)  
Target
Name:
Sodium-dependent dopamine transporter
Synonyms:
DA transporter SC6A3_RAT Sodium-dependent dopamine transporter | Sodium-dependent dopamine transporter (DAT)
Type:
Multi-pass membrane protein
Mol. Mass.:
68749.45
Organism:
Rattus norvegicus (rat)
Description:
P23977
Residue:
619
  
Inhibitor
Name:
BDBM50084717
Synonyms:
(+)-(1R,2R,3S,5S)-methyl 3-(benzoyloxy)-8-methyl-8-aza-bicyclo[3.2.1]octane-2-carboxylate (1R,2R,3S,5S)-methyl 3-(benzoyloxy)-8-methyl-8-aza-bicyclo[3.2.1]octane-2-carboxylate (1R,2R,3S,5S)-methyl 3-(benzyloxy)-8-methyl-8-aza-bicyclo[3.2.1]octane-2-carboxylate (2R,3S)-3-Benzoyloxy-2-methoxycarbonyl-8-methyl-8-azonia-bicyclo[3.2.1]octane (2R,3S,5R)-3-Benzoyloxy-8-methyl-8-aza-bicyclo[3.2.1]octane-2-carboxylic acid methyl ester (2R,3S,8S)-3-Benzoyloxy-8-methyl-8-aza-bicyclo[3.2.1]octane-2-carboxylic acid methyl ester (3S,8R)-3-Benzoyloxy-8-methyl-8-aza-bicyclo[3.2.1]octane-2-carboxylic acid methyl ester (R)-3-Benzoyloxy-8-methyl-8-aza-bicyclo[3.2.1]octane-2-carboxylic acid methyl ester (cocaine)3-Benzoyloxy-8-methyl-8-aza-bicyclo[3.2.1]octane-2-carboxylic acid methyl ester 3-Benzoyloxy-6-methyl-6-aza-bicyclo[3.2.2]nonane-4-carboxylic acid methyl ester 3-Benzoyloxy-8-methyl-8-aza-bicyclo[3.2.1]octane-2-carboxylic acid methyl ester 3-Benzoyloxy-8-methyl-8-aza-bicyclo[3.2.1]octane-2-carboxylic acid methyl ester(Cocaine) 4-(4-Chloro-benzyl)-2-(1-methyl-azepan-4-yl)-2H-phthalazin-1-one CHEMBL120901 R-3-Benzoyloxy-8-methyl-8-aza-bicyclo[3.2.1]octane-2-carboxylic acid methyl ester methyl 8-methyl-3-phenylcarbonyloxy-(3S)-8-azabicyclo[3.2.1]octane-2-carboxylate methyl 8-methyl-3-phenylcarbonyloxy-(5R)-8-azabicyclo[3.2.1]octane-2-carboxylate
Type:
Small organic molecule
Emp. Form.:
C17H21NO4
Mol. Mass.:
303.3529
SMILES:
COC(=O)[C@@H]1C2CCC(C[C@@H]1C(=O)Oc1ccccc1)N2C
: