Target
Sodium-dependent dopamine transporter
Ligand
BDBM50037935
Substrate
Meas. Tech.
ChEMBL_49339 (CHEMBL660855)
Ki
20±n/a nM
Citation
 Kelkar, SVIzenwasser, SKatz, JLKlein, CLZhu, NTrudell, ML Synthesis, cocaine receptor affinity, and dopamine uptake inhibition of several new 2 beta-substituted 3 beta-phenyltropanes. J Med Chem 37:3875-7 (1994)  
Target
Name:
Sodium-dependent dopamine transporter
Synonyms:
DA transporter SC6A3_RAT Sodium-dependent dopamine transporter | Sodium-dependent dopamine transporter (DAT)
Type:
Multi-pass membrane protein
Mol. Mass.:
68749.45
Organism:
Rattus norvegicus (rat)
Description:
P23977
Residue:
619
  
Inhibitor
Name:
BDBM50037935
Synonyms:
(E)-5-((3S,5R)-8-Methyl-3-phenyl-8-aza-bicyclo[3.2.1]oct-2-yl)-pent-2-enoic acid | CHEMBL338866
Type:
Small organic molecule
Emp. Form.:
C19H25NO2
Mol. Mass.:
299.4073
SMILES:
CN1[C@@H]2CCC1C(CC\C=C\C(O)=O)[C@H](C2)c1ccccc1
: