Target
Sodium-dependent dopamine transporter
Ligand
BDBM50037936
Substrate
Meas. Tech.
ChEMBL_62176 (CHEMBL672115)
IC50
64±n/a nM
Citation
 Kelkar, SVIzenwasser, SKatz, JLKlein, CLZhu, NTrudell, ML Synthesis, cocaine receptor affinity, and dopamine uptake inhibition of several new 2 beta-substituted 3 beta-phenyltropanes. J Med Chem 37:3875-7 (1994)  
Target
Name:
Sodium-dependent dopamine transporter
Synonyms:
DA transporter SC6A3_RAT Sodium-dependent dopamine transporter | Sodium-dependent dopamine transporter (DAT)
Type:
Multi-pass membrane protein
Mol. Mass.:
68749.45
Organism:
Rattus norvegicus (rat)
Description:
P23977
Residue:
619
  
Inhibitor
Name:
BDBM50037936
Synonyms:
3-((3S,5R)-8-Methyl-3-phenyl-8-aza-bicyclo[3.2.1]oct-2-yl)-propan-1-ol | CHEMBL339092
Type:
Small organic molecule
Emp. Form.:
C17H25NO
Mol. Mass.:
259.3865
SMILES:
CN1[C@@H]2CCC1C(CCCO)[C@H](C2)c1ccccc1
: