Target
Sodium-dependent dopamine transporter
Ligand
BDBM50037938
Substrate
Meas. Tech.
ChEMBL_62176 (CHEMBL672115)
IC50
123±n/a nM
Citation
 Kelkar, SVIzenwasser, SKatz, JLKlein, CLZhu, NTrudell, ML Synthesis, cocaine receptor affinity, and dopamine uptake inhibition of several new 2 beta-substituted 3 beta-phenyltropanes. J Med Chem 37:3875-7 (1994)  
Target
Name:
Sodium-dependent dopamine transporter
Synonyms:
DA transporter SC6A3_RAT Sodium-dependent dopamine transporter | Sodium-dependent dopamine transporter (DAT)
Type:
Multi-pass membrane protein
Mol. Mass.:
68749.45
Organism:
Rattus norvegicus (rat)
Description:
P23977
Residue:
619
  
Inhibitor
Name:
BDBM50037938
Synonyms:
(E)-3-((3S,5R)-8-Methyl-3-phenyl-8-aza-bicyclo[3.2.1]oct-2-yl)-acrylic acid methyl ester | CHEMBL340793
Type:
Small organic molecule
Emp. Form.:
C18H23NO2
Mol. Mass.:
285.3807
SMILES:
COC(=O)\C=C\C1C2CC[C@H](C[C@@H]1c1ccccc1)N2C
: