Target
Cathepsin D
Ligand
BDBM50040388
Substrate
Meas. Tech.
ChEMBL_44978 (CHEMBL660139)
IC50
>10000±n/a nM
Citation
 Raddatz, PMinck, KORippmann, FSchmitges, CJ Non-peptide renin inhibitors containing 2-(((3-phenylpropyl)phosphoryl)oxy)alkanoic acid moieties as P2-P3 replacements. J Med Chem 37:486-97 (1994)  
Target
Name:
Cathepsin D
Synonyms:
CATD_BOVIN | CTSD
Type:
PROTEIN
Mol. Mass.:
42158.92
Organism:
Bos taurus
Description:
ChEMBL_1458606
Residue:
387
  
Inhibitor
Name:
BDBM50040388
Synonyms:
(3-Phenyl-propyl)-phosphonic acid mono-[(R)-1-((1S,2S,4R)-4-butylcarbamoyl-1-cyclohexylmethyl-2-hydroxy-pentylcarbamoyl)-butyl] ester | CHEMBL144073
Type:
Small organic molecule
Emp. Form.:
C31H53N2O6P
Mol. Mass.:
580.7361
SMILES:
CCCCNC(=O)[C@H](C)C[C@H](O)[C@H](CC1CCCCC1)NC(=O)[C@@H](CCC)OP(O)(=O)CCCc1ccccc1
: