Target
Kynureninase
Ligand
BDBM50061907
Substrate
Meas. Tech.
ChEMBL_91724 (CHEMBL702022)
IC50
100000±n/a nM
Citation
 Pellicciari, RNatalini, BCostantino, GMahmoud, MRMattoli, LSadeghpour, BMMoroni, FChiarugi, ACarpenedo, R Modulation of the kynurenine pathway in search for new neuroprotective agents. Synthesis and preliminary evaluation of (m-nitrobenzoyl)alanine, a potent inhibitor of kynurenine-3-hydroxylase. J Med Chem 37:647-55 (1994)  
Target
Name:
Kynureninase
Synonyms:
KYNU_RAT | Kynu
Type:
PROTEIN
Mol. Mass.:
52470.50
Organism:
Rattus norvegicus
Description:
ChEMBL_91725
Residue:
464
  
Inhibitor
Name:
BDBM50061907
Synonyms:
(+/-)-2-Amino-4-(3-nitro-phenyl)-4-oxo-butyric acid[(+/-)-m-nicotinylbenzoylalanine] CHEMBL23983 | meta-nitrobenzoyl)alanine
Type:
Small organic molecule
Emp. Form.:
C10H10N2O5
Mol. Mass.:
238.1968
SMILES:
NC(CC(=O)c1cccc(c1)[N+]([O-])=O)C(O)=O
: