Target
Kynureninase
Ligand
BDBM50040570
Substrate
Meas. Tech.
ChEMBL_91724 (CHEMBL702022)
IC50
800000±n/a nM
Citation
 Pellicciari, RNatalini, BCostantino, GMahmoud, MRMattoli, LSadeghpour, BMMoroni, FChiarugi, ACarpenedo, R Modulation of the kynurenine pathway in search for new neuroprotective agents. Synthesis and preliminary evaluation of (m-nitrobenzoyl)alanine, a potent inhibitor of kynurenine-3-hydroxylase. J Med Chem 37:647-55 (1994)  
Target
Name:
Kynureninase
Synonyms:
KYNU_RAT | Kynu
Type:
PROTEIN
Mol. Mass.:
52470.50
Organism:
Rattus norvegicus
Description:
ChEMBL_91725
Residue:
464
  
Inhibitor
Name:
BDBM50040570
Synonyms:
CHEMBL160527 nicotinoylalanine(NAL)
Type:
Small organic molecule
Emp. Form.:
C9H10N2O3
Mol. Mass.:
194.1873
SMILES:
[NH3+]C(CC(=O)c1cccnc1)C([O-])=O
: