Target
Sodium-dependent serotonin transporter
Ligand
BDBM50453639
Substrate
Meas. Tech.
ChEMBL_201656 (CHEMBL803030)
IC50
0.360000±n/a nM
Citation
 Boja, JWKuhar, MJKopajtic, TYang, EAbraham, PLewin, AHCarroll, FI Secondary amine analogues of 3 beta-(4'-substituted phenyl)tropane-2 beta-carboxylic acid esters and N-norcocaine exhibit enhanced affinity for serotonin and norepinephrine transporters. J Med Chem 37:1220-3 (1994)  
Target
Name:
Sodium-dependent serotonin transporter
Synonyms:
5-HT Transporter 5HT transporter Anandamid membrane transporter, AMT Monoamine transporters; Norepinephrine & serotonin Slc6a4 Sodium-dependent serotonin transporter (SERT) | imipramine receptor
Type:
Multi-pass membrane protein
Mol. Mass.:
70168.43
Organism:
Rattus norvegicus (rat)
Description:
P31652
Residue:
630
  
Inhibitor
Name:
BDBM50453639
Synonyms:
CHEMBL2112889
Type:
Small organic molecule
Emp. Form.:
C15H18INO2
Mol. Mass.:
371.2134
SMILES:
[H][C@]12CCC(N1)[C@H]([C@H](C2)c1ccc(I)cc1)C(=O)OC
: