Target
Sodium-dependent dopamine transporter
Ligand
BDBM50005576
Substrate
Meas. Tech.
ChEMBL_62019 (CHEMBL671786)
IC50
1.3±n/a nM
Citation
 Boja, JWKuhar, MJKopajtic, TYang, EAbraham, PLewin, AHCarroll, FI Secondary amine analogues of 3 beta-(4'-substituted phenyl)tropane-2 beta-carboxylic acid esters and N-norcocaine exhibit enhanced affinity for serotonin and norepinephrine transporters. J Med Chem 37:1220-3 (1994)  
Target
Name:
Sodium-dependent dopamine transporter
Synonyms:
DA transporter SC6A3_RAT Sodium-dependent dopamine transporter | Sodium-dependent dopamine transporter (DAT)
Type:
Multi-pass membrane protein
Mol. Mass.:
68749.45
Organism:
Rattus norvegicus (rat)
Description:
P23977
Residue:
619
  
Inhibitor
Name:
BDBM50005576
Synonyms:
(3S,8R)-3-(4-Iodo-phenyl)-8-methyl-8-aza-bicyclo[3.2.1]octane-2-carboxylic acid methyl ester CHEMBL300226
Type:
Small organic molecule
Emp. Form.:
C16H20INO2
Mol. Mass.:
385.24
SMILES:
COC(=O)C1C2CC[C@H](C[C@@H]1c1ccc(I)cc1)N2C
: