Target
S-adenosylmethionine decarboxylase proenzyme
Ligand
BDBM50034925
Substrate
Meas. Tech.
ChEMBL_197029 (CHEMBL803860)
Ki
21200±n/a nM
Citation
 Guo, JWu, YQRattendi, DBacchi, CJWoster, PM S-(5'-deoxy-5'-adenosyl)-1-aminoxy-4-(methylsulfonio)-2-cyclopentene (AdoMao): an irreversible inhibitor of S-adenosylmethionine decarboxylase with potent in vitro antitrypanosomal activity. J Med Chem 38:1770-7 (1995)  
Target
Name:
S-adenosylmethionine decarboxylase proenzyme
Synonyms:
AMD DCAM_HUMAN S-adenosylmethionine decarboxylase 1 | SAMDC
Type:
Heterotetramer of two alpha and two beta chains
Mol. Mass.:
38337.21
Organism:
Homo sapiens (Human)
Description:
For the production of protein for the hAdoMetDC enzyme assays, the plasmid containing (H)6 tag at the carboxyl end (replacing -QQQQQS) was used.
Residue:
334
  
Inhibitor
Name:
BDBM50034925
Synonyms:
CHEMBL299398 | O-{(1S,4S)-4-[6-(6-Amino-purin-9-yl)-2,2-dimethyl-tetrahydro-furo[3,4-d][1,3]dioxol-4-ylmethylsulfanyl]-cyclopent-2-enyl}-hydroxylamine
Type:
Small organic molecule
Emp. Form.:
C18H24N6O4S
Mol. Mass.:
420.486
SMILES:
CC1(C)OC2C(CS[C@H]3C[C@H](ON)C=C3)OC(C2O1)n1cnc2c(N)ncnc12
: