Target
Tyrosine-protein kinase ABL1
Ligand
BDBM50031650
Substrate
Meas. Tech.
ChEMBL_226175 (CHEMBL847372)
IC50
>100000±n/a nM
Citation
 Traxler, PTrinks, UBuchdunger, EMett, HMeyer, TMüller, MRegenass, URösel, JLydon, N [(Alkylamino)methyl]acrylophenones: potent and selective inhibitors of the epidermal growth factor receptor protein tyrosine kinase. J Med Chem 38:2441-8 (1995)  
Target
Name:
Tyrosine-protein kinase ABL1
Synonyms:
ABL ABL1_HUMAN JTK7 Proto-oncogene tyrosine-protein kinase ABL1 Tyrosine-protein kinase ABL V-abl Abelson murine leukemia viral oncogene homolog 1 p150 | tyrosine-protein kinase ABL1 isoform a
Type:
Enzyme
Mol. Mass.:
122897.30
Organism:
Homo sapiens (Human)
Description:
P00519
Residue:
1130
  
Inhibitor
Name:
BDBM50031650
Synonyms:
2-[3-(4-Benzyloxy-phenyl)-2-dimethylaminomethyl-3-oxo-propylsulfanyl]-benzoic acid methyl ester; hydrochloride | CHEMBL538757
Type:
Small organic molecule
Emp. Form.:
C27H29NO4S
Mol. Mass.:
463.588
SMILES:
COC(=O)c1ccccc1SCC(CN(C)C)C(=O)c1ccc(OCc2ccccc2)cc1
: