Target
B2 bradykinin receptor
Ligand
BDBM50403371
Substrate
Meas. Tech.
ChEMBL_40270 (CHEMBL656505)
IC50
1.1±n/a nM
Citation
 Stahl, WBreipohl, GKuhlmann, LSteinsträsser, AGerhards, HJSchölkens, BA Technetium-99m-labeled HOE 140: a potential bradykinin B2 receptor imaging agent. J Med Chem 38:2799-801 (1995)  
Target
Name:
B2 bradykinin receptor
Synonyms:
B2 bradykinin receptor BDKRB2 BKRB2_CAVPO | Bradykinin B2 receptor
Type:
Mol. Mass.:
42217.03
Organism:
Cavia porcellus
Description:
Residue:
372
  
Inhibitor
Name:
BDBM50403371
Synonyms:
Firazyr ICATIBANT
Type:
Small organic molecule
Emp. Form.:
C59H89N19O13S
Mol. Mass.:
1304.522
SMILES:
[#7]-[#6@H](-[#6]-[#6]-[#6]\[#7]=[#6](\[#7])-[#7])-[#6](=O)-[#7]-[#6@@H](-[#6]-[#6]-[#6]\[#7]=[#6](\[#7])-[#7])-[#6](=O)-[#7]-1-[#6]-[#6]-[#6]-[#6@H]-1-[#6](=O)-[#7]-1-[#6]-[#6@H](-[#8])-[#6]-[#6@H]-1-[#6](=O)-[#7]-[#6]-[#6](=O)-[#7]-[#6@@H](-[#6]-c1cccs1)-[#6](=O)-[#7]-[#6@@H](-[#6]-[#8])-[#6](=O)-[#7]-1-[#6]-c2ccccc2-[#6]-[#6@@H]-1-[#6](=O)-[#7]-1-[#6@H]-2-[#6]-[#6]-[#6]-[#6]-[#6@H]-2-[#6]-[#6@H]-1-[#6](=O)-[#7]-[#6@@H](-[#6]-[#6]-[#6]\[#7]=[#6](\[#7])-[#7])-[#6](-[#8])=O
: