Target
Sigma non-opioid intracellular receptor 1
Ligand
BDBM50032406
Substrate
Meas. Tech.
ChEMBL_202057 (CHEMBL809529)
Ki
832±n/a nM
Citation
 Danso-Danquah, RBai, XZhang, XMascarella, SWWilliams, WSine, BBowen, WDCarroll, FI Synthesis and sigma binding properties of 2'-substituted 5,9 alpha-dimethyl-6,7-benzomorphans. J Med Chem 38:2978-85 (1995)  
Target
Name:
Sigma non-opioid intracellular receptor 1
Synonyms:
Opioid receptor SGMR1_RAT Sigma non-opioid intracellular receptor 1 Sigma-1 | Sigmar1
Type:
Enzyme Catalytic Domain
Mol. Mass.:
25266.54
Organism:
RAT
Description:
Q9R0C9
Residue:
223
  
Inhibitor
Name:
BDBM50032406
Synonyms:
3-Benzyl-6,11-dimethyl-1,2,3,4,5,6-hexahydro-2,6-methano-benzo[d]azocin-8-ylamine | CHEMBL102406
Type:
Small organic molecule
Emp. Form.:
C21H26N2
Mol. Mass.:
306.4445
SMILES:
CC1C2Cc3ccc(N)cc3C1(C)CCN2Cc1ccccc1
: