Target
Melanocyte-stimulating hormone receptor
Ligand
BDBM50033130
Substrate
Meas. Tech.
ChEMBL_105827 (CHEMBL716487)
EC50
2±n/a nM
Citation
 Hruby, VJLu, DSharma, SDCastrucci, ALKesterson, RAal-Obeidi, FAHadley, MECone, RD Cyclic lactam alpha-melanotropin analogues of Ac-Nle4-cyclo[Asp5, D-Phe7,Lys10] alpha-melanocyte-stimulating hormone-(4-10)-NH2 with bulky aromatic amino acids at position 7 show high antagonist potency and selectivity at specific melanocortin receptors. J Med Chem 38:3454-61 (1995)  
Target
Name:
Melanocyte-stimulating hormone receptor
Synonyms:
MC1-R MSH-R MSHR_HUMAN Melanocortin receptor (M1 and M4) Melanocortin receptor 1 (MC1-R) | Melanocortin receptor 1 (MC1R)
Type:
Enzyme
Mol. Mass.:
34717.23
Organism:
Homo sapiens (Human)
Description:
Q01726
Residue:
317
  
Inhibitor
Name:
BDBM50033130
Synonyms:
(3R,6S,9R,12S,15S,23R)-15-((S)-2-Acetylamino-hexanoylamino)-9-(4-chloro-benzyl)-6-(3-guanidino-propyl)-12-(3H-imidazol-4-ylmethyl)-3-(1H-indol-3-ylmethyl)-2,5,8,11,14,17-hexaoxo-1,4,7,10,13,18hexaaza-cyclotricosane-23-carboxylic acid amide | CHEMBL413212
Type:
Small organic molecule
Emp. Form.:
C50H68ClN15O9
Mol. Mass.:
1058.623
SMILES:
CCCC[C@H](NC(C)=O)C(=O)N[C@H]1CC(=O)NCCCC[C@@H](NC(=O)[C@@H](Cc2c[nH]c3ccccc23)NC(=O)[C@H](CCCNC(N)=N)NC(=O)[C@@H](Cc2ccc(Cl)cc2)NC(=O)[C@H](Cc2cnc[nH]2)NC1=O)C(N)=O
: