Target
Melanocyte-stimulating hormone receptor
Ligand
BDBM50029747
Substrate
Meas. Tech.
ChEMBL_105858 (CHEMBL717328)
EC50
1.3±n/a nM
Citation
 Hruby, VJLu, DSharma, SDCastrucci, ALKesterson, RAal-Obeidi, FAHadley, MECone, RD Cyclic lactam alpha-melanotropin analogues of Ac-Nle4-cyclo[Asp5, D-Phe7,Lys10] alpha-melanocyte-stimulating hormone-(4-10)-NH2 with bulky aromatic amino acids at position 7 show high antagonist potency and selectivity at specific melanocortin receptors. J Med Chem 38:3454-61 (1995)  
Target
Name:
Melanocyte-stimulating hormone receptor
Synonyms:
MC1-R Mc1r Melanocyte-stimulating hormone receptor | Msh-r
Type:
PROTEIN
Mol. Mass.:
35238.60
Organism:
Mus musculus
Description:
ChEMBL_1498846
Residue:
315
  
Inhibitor
Name:
BDBM50029747
Synonyms:
(4S)-4-{[(1S)-1-{[(1S)-1-{[(1S)-1-{[(1S)-1-[({[(2S)-6-amino-1-[(2S)-2-{[(1S)-1-carbamoyl-2-methylpropyl]carbamoyl}pyrrolidin-1-yl]-1-oxohexan-2-yl]carbamoyl}methyl)carbamoyl]-2-(1H-indol-3-yl)ethyl]carbamoyl}-4-carbamimidamidobutyl]carbamoyl}-2-phenylethyl]carbamoyl}-2-(1H-imidazol-5-yl)ethyl]carbamoyl}-4-[(2S)-2-[(2S)-2-[(2S)-2-[(2S)-2-acetamido-3-hydroxypropanamido]-3-(4-hydroxyphenyl)propanamido]-3-hydroxypropanamido]-4-(methylsulfanyl)butanamido]butanoic acid Ac-S-Y-S-M-E-H-F-R-W-G-K-P-V-NH2 Ac-Ser-Tyr-Nle-Glu-His-D-Phe-Arg-Trp-Gly-Lys-Pro-Val-NH2 Ac-Ser-Tyr-Ser-Met-Glu-His-Phe-Arg-Trp-Gly-Lys-Pro-Val-NH2(alpha-MSH) Ac-Ser-Tyr-Ser-Met-Glu-His6-Phe7-Arg8-Trp9-Gly-Lys-Pro-Val-NH2 CHEMBL214332 alpha-MSH; Ac-Ser-Tyr-Ser-Met-Glu-His-DPhe-Arg-Trp-Gly-Lys-Pro-Val-NH2
Type:
Small organic molecule
Emp. Form.:
C77H109N21O19S
Mol. Mass.:
1664.884
SMILES:
CSCC[C@H](NC(=O)[C@H](CO)NC(=O)[C@H](Cc1ccc(O)cc1)NC(=O)[C@H](CO)NC(C)=O)C(=O)N[C@@H](CCC(O)=O)C(=O)N[C@@H](Cc1cnc[nH]1)C(=O)N[C@@H](Cc1ccccc1)C(=O)N[C@@H](CCCNC(N)=N)C(=O)N[C@@H](Cc1c[nH]c2ccccc12)C(=O)NCC(=O)N[C@@H](CCCCN)C(=O)N1CCC[C@H]1C(=O)N[C@@H](C(C)C)C(N)=O
: