Target
Muscarinic acetylcholine receptor M1
Ligand
BDBM50453786
Substrate
Meas. Tech.
ChEMBL_138812 (CHEMBL747493)
IC50
3.7±n/a nM
Citation
 Ward, JSMerritt, LCalligaro, DOBymaster, FPShannon, HESawyer, BDMitch, CHDeeter, JBPeters, SCSheardown, MJ Functionally selective M1 muscarinic agonists. 3. Side chains and azacycles contributing to functional muscarinic selectivity among pyrazinylazacycles. J Med Chem 38:3469-81 (1995)  
Target
Name:
Muscarinic acetylcholine receptor M1
Synonyms:
ACM1_RAT Chrm-1 cholinergic receptor, muscarinic 1
Type:
Enzyme Catalytic Domain
Mol. Mass.:
51390.46
Organism:
RAT
Description:
P08482
Residue:
460
  
Inhibitor
Name:
BDBM50453786
Synonyms:
CHEMBL2092949
Type:
Small organic molecule
Emp. Form.:
C17H27N3O
Mol. Mass.:
289.4158
SMILES:
CCCCCCOc1nccnc1[C@@H]1CN2CCC1CC2
: