Target
Ribonucleoside-diphosphate reductase large subunit/subunit M2
Ligand
BDBM50033466
Substrate
Meas. Tech.
ChEMBL_195386 (CHEMBL806875)
IC50
180±n/a nM
Citation
 Moss, NBeaulieu, PDuceppe, JSFerland, JMGauthier, JGhiro, EGoulet, SGrenier, LLlinas-Brunet, MPlante, R Peptidomimetic inhibitors of herpes simplex virus ribonucleotide reductase: a new class of antiviral agents. J Med Chem 38:3617-23 (1995)  
Target
Name:
Ribonucleoside-diphosphate reductase large subunit/subunit M2
Synonyms:
RRM1/RRM2 holoenzyme | Ribonucleoside-diphosphate reductase M1/M2 chain
Type:
Enzyme
Mol. Mass.:
Description:
Components:
This complex has 2 components.
Component 1
Name:
Ribonucleoside-diphosphate reductase large subunit
Synonyms:
RIR1_HUMAN RRM1 Ribonucleoside-diphosphate reductase subunit M1 | Ribonucleotide reductase large subunit
Type:
PROTEIN
Mol. Mass.:
90074.67
Organism:
Homo sapiens (Human)
Description:
ChEMBL_90946
Residue:
792
  
Component 2
Name:
Ribonucleoside-diphosphate reductase subunit M2
Synonyms:
RIR2_HUMAN RRM2 Ribonucleotide reductase small chain | Ribonucleotide reductase small subunit
Type:
PROTEIN
Mol. Mass.:
44868.59
Organism:
Homo sapiens (Human)
Description:
ChEMBL_195255
Residue:
389
  
Inhibitor
Name:
BDBM50033466
Synonyms:
(S)-2-[(S)-2-((S)-2-{(S)-2-[(S)-2-(2-Benzyl-3-phenyl-propionylamino)-3-methyl-butyrylamino]-3-methyl-butyrylamino}-3-carbamoyl-propionylamino)-3-carboxy-propionylamino]-4-methyl-pentanoic acid | CHEMBL19667
Type:
Small organic molecule
Emp. Form.:
C40H56N6O10
Mol. Mass.:
780.9068
SMILES:
CC(C)C[C@H](NC(=O)[C@H](CC(O)=O)NC(=O)[C@H](CC(N)=O)NC(=O)[C@@H](NC(=O)[C@@H](NC(=O)C(Cc1ccccc1)Cc1ccccc1)C(C)C)C(C)C)C(O)=O
: