Target
Beta-3 adrenergic receptor
Ligand
BDBM50407518
Substrate
Meas. Tech.
ChEMBL_39069 (CHEMBL651140)
EC50
63000±n/a nM
Citation
 Ruffolo, RRBondinell, WHieble, JP Alpha- and beta-adrenoceptors: from the gene to the clinic. 2. Structure-activity relationships and therapeutic applications. J Med Chem 38:3681-716 (1995)  
Target
Name:
Beta-3 adrenergic receptor
Synonyms:
ADRB3_RAT Adrb3r Beta-3 adrenergic receptor
Type:
PROTEIN
Mol. Mass.:
43161.83
Organism:
Rattus norvegicus
Description:
ChEMBL_1509452
Residue:
400
  
Inhibitor
Name:
BDBM50407518
Synonyms:
ISOPROTERENOL LEVISOPRENALINE
Type:
Small organic molecule
Emp. Form.:
C11H17NO3
Mol. Mass.:
211.2576
SMILES:
CC(C)NC[C@@H](O)c1ccc(O)c(O)c1
: