Target
5-hydroxytryptamine receptor 1A
Ligand
BDBM50029270
Substrate
Meas. Tech.
ChEMBL_1143 (CHEMBL616088)
Ki
1.9±n/a nM
Citation
 Scott, MKBaxter, EWBennett, DJBoyd, REBlum, PSCodd, EEKukla, MJMalloy, EMaryanoff, BEMaryanoff, CA Piperazinylalkyl heterocycles as potential antipsychotic agents. J Med Chem 38:4198-210 (1995)  
Target
Name:
5-hydroxytryptamine receptor 1A
Synonyms:
5-HT-1A 5-HT1A 5-hydroxytryptamine receptor 1A (5HT1A) 5ht1a Htr1a Serotonin 1a (5-HT1a) receptor/Adrenergic receptor alpha-1 | Serotonin receptor 1A
Type:
G Protein-Coupled Receptor (GPCR)
Mol. Mass.:
46445.29
Organism:
Rattus norvegicus (rat)
Description:
Binding assays were performed using rat hippocampal membranes.
Residue:
422
  
Inhibitor
Name:
BDBM50029270
Synonyms:
2-{5-[4-(2-Methoxy-phenyl)-piperazin-1-ylmethyl]-furan-2-ylmethyl}-isoindole-1,3-dione | CHEMBL133765
Type:
Small organic molecule
Emp. Form.:
C25H25N3O4
Mol. Mass.:
431.4837
SMILES:
COc1ccccc1N1CCN(Cc2ccc(CN3C(=O)c4ccccc4C3=O)o2)CC1
: