Target
5-hydroxytryptamine receptor 1A
Ligand
BDBM50029280
Substrate
Meas. Tech.
ChEMBL_1143 (CHEMBL616088)
Ki
0.63±n/a nM
Citation
 Scott, MKBaxter, EWBennett, DJBoyd, REBlum, PSCodd, EEKukla, MJMalloy, EMaryanoff, BEMaryanoff, CA Piperazinylalkyl heterocycles as potential antipsychotic agents. J Med Chem 38:4198-210 (1995)  
Target
Name:
5-hydroxytryptamine receptor 1A
Synonyms:
5-HT-1A 5-HT1A 5-hydroxytryptamine receptor 1A (5HT1A) 5ht1a Htr1a Serotonin 1a (5-HT1a) receptor/Adrenergic receptor alpha-1 | Serotonin receptor 1A
Type:
G Protein-Coupled Receptor (GPCR)
Mol. Mass.:
46445.29
Organism:
Rattus norvegicus (rat)
Description:
Binding assays were performed using rat hippocampal membranes.
Residue:
422
  
Inhibitor
Name:
BDBM50029280
Synonyms:
CHEMBL544371 | [5-(4-Benzofuran-7-yl-piperazin-1-ylmethyl)-thiophen-2-yl]-piperidin-1-yl-methanone; hydrochloride
Type:
Small organic molecule
Emp. Form.:
C23H27N3O2S
Mol. Mass.:
409.544
SMILES:
O=C(N1CCCCC1)c1ccc(CN2CCN(CC2)c2cccc3ccoc23)s1
: