Target
5-hydroxytryptamine receptor 1A
Ligand
BDBM50029304
Substrate
Meas. Tech.
ChEMBL_1435 (CHEMBL616308)
Ki
29±n/a nM
Citation
 Reitz, ABBaxter, EWBennett, DJCodd, EEJordan, ADMalloy, EAMaryanoff, BEMcDonnell, MEOrtegon, MERenzi, MJ N-aryl-N'-benzylpiperazines as potential antipsychotic agents. J Med Chem 38:4211-22 (1995)  
Target
Name:
5-hydroxytryptamine receptor 1A
Synonyms:
5-HT-1A 5-HT1A 5-hydroxytryptamine receptor 1A (5HT1A) 5ht1a Htr1a Serotonin 1a (5-HT1a) receptor/Adrenergic receptor alpha-1 | Serotonin receptor 1A
Type:
G Protein-Coupled Receptor (GPCR)
Mol. Mass.:
46445.29
Organism:
Rattus norvegicus (rat)
Description:
Binding assays were performed using rat hippocampal membranes.
Residue:
422
  
Inhibitor
Name:
BDBM50029304
Synonyms:
1-(2-Isopropoxy-phenyl)-4-(4-pyrrolidin-1-ylmethyl-benzyl)-piperazine | CHEMBL135246
Type:
Small organic molecule
Emp. Form.:
C25H35N3O
Mol. Mass.:
393.5649
SMILES:
CC(C)Oc1ccccc1N1CCN(Cc2ccc(CN3CCCC3)cc2)CC1
: