Target
D(2) dopamine receptor
Ligand
BDBM50029326
Substrate
Meas. Tech.
ChEMBL_63038 (CHEMBL678341)
Ki
20±n/a nM
Citation
 Reitz, ABBaxter, EWBennett, DJCodd, EEJordan, ADMalloy, EAMaryanoff, BEMcDonnell, MEOrtegon, MERenzi, MJ N-aryl-N'-benzylpiperazines as potential antipsychotic agents. J Med Chem 38:4211-22 (1995)  
Target
Name:
D(2) dopamine receptor
Synonyms:
DOPAMINE D2 DOPAMINE D2 Short Dopamine D2 receptor Drd2
Type:
G Protein-Coupled Receptor (GPCR)
Mol. Mass.:
50931.60
Organism:
Rattus norvegicus (rat)
Description:
P61169
Residue:
444
  
Inhibitor
Name:
BDBM50029326
Synonyms:
8-{3-[4-(2-Isopropoxy-phenyl)-piperazin-1-ylmethyl]-benzyl}-8-aza-spiro[4.5]decane-7,9-dione | CHEMBL423712
Type:
Small organic molecule
Emp. Form.:
C30H39N3O3
Mol. Mass.:
489.649
SMILES:
CC(C)Oc1ccccc1N1CCN(Cc2cccc(CN3C(=O)CC4(CCCC4)CC3=O)c2)CC1
: