Target
Polyunsaturated fatty acid 5-lipoxygenase
Ligand
BDBM50029775
Substrate
Meas. Tech.
ChEMBL_4071 (CHEMBL620873)
IC50
80±n/a nM
Citation
 Brooks, CDStewart, AOBasha, ABhatia, PRatajczyk, JDMartin, JGCraig, RAKolasa, TBouska, JBLanni, C (R)-(+)-N-[3-[5-[(4-fluorophenyl)methyl]-2-thienyl]-1-methyl- 2-propynyl]-N-hydroxyurea (ABT-761), a second-generation 5-lipoxygenase inhibitor. J Med Chem 38:4768-75 (1996)  
Target
Name:
Polyunsaturated fatty acid 5-lipoxygenase
Synonyms:
5-LO 5-Lipoxygenase (5-LO) 5-Lipoygenase ALOX5 LOG5 | LOX5_HUMAN
Type:
Enzyme
Mol. Mass.:
77972.74
Organism:
Homo sapiens (Human)
Description:
Recombinant protein was purified from E. coli lysate. After ammonium sulfate precipitation and subsequent steps, the supernatant (S100) was used for 5-LO activity assay.
Residue:
674
  
Inhibitor
Name:
BDBM50029775
Synonyms:
(R)-(+)-N-{3-[5-(4-fluorophenoxy)furan-2-yl]-1-methylprop-2-ynyl}-N-hydroxyurea A-78773 N-{3-[5-(4-fluorophenoxy)-2-furyl]-1-methylprop-2-ynyl}-N-hydroxyurea N-{3-[5-(4-fluorophenoxy)furan-2-yl]-1-methylprop-2-ynyl}-N-hydroxyurea
Type:
Small organic molecule
Emp. Form.:
C15H13FN2O4
Mol. Mass.:
304.2731
SMILES:
CC(C#Cc1ccc(Oc2ccc(F)cc2)o1)N(O)C(N)=O
: