Target
Thyroid hormone receptor beta
Ligand
BDBM50036406
Substrate
Meas. Tech.
ChEMBL_143915 (CHEMBL752718)
IC50
1.1±n/a nM
Citation
 Yokoyama, NWalker, GNMain, AJStanton, JLMorrissey, MMBoehm, CEngle, ANeubert, ADWasvary, JMStephan, ZF Synthesis and structure-activity relationships of oxamic acid and acetic acid derivatives related to L-thyronine. J Med Chem 38:695-707 (1995)  
Target
Name:
Thyroid hormone receptor beta
Synonyms:
Erba2 THB_RAT Thyroid Hormone Receptor (TR-beta) Thyroid hormone receptor beta-1 | thyroid beta
Type:
Enzyme Catalytic Domain
Mol. Mass.:
52661.52
Organism:
RAT
Description:
thyroid beta 0 RAT::P18113
Residue:
461
  
Inhibitor
Name:
BDBM50036406
Synonyms:
CHEMBL163380 | [3,5-Dichloro-4-(4-hydroxy-3-isopropyl-phenoxy)-phenylamino]-acetic acid
Type:
Small organic molecule
Emp. Form.:
C17H17Cl2NO4
Mol. Mass.:
370.227
SMILES:
CC(C)c1cc(Oc2c(Cl)cc(NCC(O)=O)cc2Cl)ccc1O
: