Target
Integrase
Ligand
BDBM23408
Substrate
Meas. Tech.
ChEMBL_90698 (CHEMBL702099)
IC50
100±n/a nM
Citation
 Raghavan, KBuolamwini, JKFesen, MRPommier, YKohn, KWWeinstein, JN Three-dimensional quantitative structure-activity relationship (QSAR) of HIV integrase inhibitors: a comparative molecular field analysis (CoMFA) study. J Med Chem 38:890-7 (1995)  
Target
Name:
Integrase
Synonyms:
Human immunodeficiency virus type 1 integrase
Type:
PROTEIN
Mol. Mass.:
32231.48
Organism:
Human immunodeficiency virus 1
Description:
ChEMBL_90865
Residue:
288
  
Inhibitor
Name:
BDBM23408
Synonyms:
2-(3,4-dihydroxyphenyl)-3,5,6,7-tetrahydroxy-4H-chromen-4-one Quercetagetin US11759530, Compound Table1.8
Type:
flavonol
Emp. Form.:
C15H10O8
Mol. Mass.:
318.2351
SMILES:
Oc1ccc(cc1O)-c1oc2cc(O)c(O)c(O)c2c(=O)c1O
: