Target
Gag-Pol polyprotein [489-587]
Ligand
BDBM50051634
Substrate
Meas. Tech.
ChEMBL_159456 (CHEMBL766801)
IC50
33000±n/a nM
Citation
 Mazumder, AWang, SNeamati, NNicklaus, MSunder, SChen, JMilne, GWRice, WGBurke, TRPommier, Y Antiretroviral agents as inhibitors of both human immunodeficiency virus type 1 integrase and protease. J Med Chem 39:2472-81 (1996)  
Target
Name:
Gag-Pol polyprotein [489-587]
Synonyms:
Human immunodeficiency virus type 1 protease Pol polyprotein | gag-pol
Type:
Enzyme Subunit
Mol. Mass.:
10781.16
Organism:
Human immunodeficiency virus type 1
Description:
P04585[489-587]
Residue:
99
  
Inhibitor
Name:
BDBM50051634
Synonyms:
2-Heptylamino-3-hydroxy-[1,4]naphthoquinone NSC-129153
Type:
Small organic molecule
Emp. Form.:
C17H21NO3
Mol. Mass.:
287.3535
SMILES:
CCCCCCC=Nc1c(O)c(O)c2ccccc2c1O
: