Target
Metabotropic glutamate receptor 6
Ligand
BDBM50026947
Substrate
Meas. Tech.
ChEMBL_104472 (CHEMBL712389)
EC50
>1000000±n/a nM
Citation
 Bräuner-Osborne, HSløk, FASkjaerbaek, NEbert, BSekiyama, NNakanishi, SKrogsgaard-Larsen, P A new highly selective metabotropic excitatory amino acid agonist: 2-amino-4-(3-hydroxy-5-methylisoxazol-4-yl)butyric acid. J Med Chem 39:3188-94 (1996)  
Target
Name:
Metabotropic glutamate receptor 6
Synonyms:
GPRC1F GRM6_HUMAN Metabotropic glutamate receptor 6 metabotropic glutamate 6
Type:
Enzyme Catalytic Domain
Mol. Mass.:
95479.26
Organism:
Homo sapiens (Human)
Description:
metabotropic glutamate 6 GRM6 HUMAN::O15303
Residue:
877
  
Inhibitor
Name:
BDBM50026947
Synonyms:
(R)-2-Amino-3-(3-hydroxy-5-methyl-isoxazol-4-yl)-propionic acid 2-Amino-3-(3-hydroxy-5-methyl-isoxazol-4-yl)-propionic acid(D-AMPA) | CHEMBL14815
Type:
Small organic molecule
Emp. Form.:
C7H10N2O4
Mol. Mass.:
186.1653
SMILES:
Cc1o[nH]c(=O)c1C[C@@H](N)C(O)=O
: