Target
5-hydroxytryptamine receptor 2A
Ligand
BDBM50053691
Substrate
Meas. Tech.
ChEMBL_2297 (CHEMBL617082)
Ki
4±n/a nM
Citation
 Hrib, NJJurcak, JGBregna, DEBurgher, KLHartman, HBKafka, SKerman, LLKongsamut, SRoehr, JESzewczak, MRWoods-Kettelberger, ATCorbett, R Structure-activity relationships of a series of novel (piperazinylbutyl)thiazolidinone antipsychotic agents related to 3-[4-[4-(6-fluorobenzo[b]thien-3-yl)-1-piperazinyl]butyl]-2,5,5- trimethyl-4-thiazolidinone maleate. J Med Chem 39:4044-57 (1996)  
Target
Name:
5-hydroxytryptamine receptor 2A
Synonyms:
5-HT-2 5-HT2A 5-hydroxytryptamine receptor 2A (5HT-2A) 5HT2A_HUMAN HTR2A | Serotonin receptor 2A
Type:
undefined
Mol. Mass.:
52607.65
Organism:
Homo sapiens (Human)
Description:
P28223
Residue:
471
  
Inhibitor
Name:
BDBM50053691
Synonyms:
3-{4-[4-(6-Fluoro-benzo[b]thiophen-3-yl)-piperazin-1-yl]-butyl}-2-methyl-1-thia-3-aza-spiro[4.4]nonan-4-one | CHEMBL131482
Type:
Small organic molecule
Emp. Form.:
C24H32FN3OS2
Mol. Mass.:
461.659
SMILES:
CC1SC2(CCCC2)C(=O)N1CCCCN1CCN(CC1)c1csc2cc(F)ccc12
: