Target
Dihydroorotate dehydrogenase (quinone), mitochondrial
Ligand
BDBM50054564
Substrate
Meas. Tech.
ChEMBL_52873 (CHEMBL666232)
IC50
71±n/a nM
Citation
 Kuo, EAHambleton, PTKay, DPEvans, PLMatharu, SSLittle, EMcDowall, NJones, CBHedgecock, CJYea, CMChan, AWHairsine, PWAger, IRTully, WRWilliamson, RAWestwood, R Synthesis, structure-activity relationships, and pharmacokinetic properties of dihydroorotate dehydrogenase inhibitors: 2-cyano-3-cyclopropyl-3-hydroxy-N-[3'-methyl-4'-(trifluoromethyl)phenyl ] propenamide and related compounds. J Med Chem 39:4608-21 (1996)  
Target
Name:
Dihydroorotate dehydrogenase (quinone), mitochondrial
Synonyms:
Dhodh PYRD_MOUSE
Type:
PROTEIN
Mol. Mass.:
42711.08
Organism:
Mus musculus
Description:
ChEMBL_1366444
Residue:
395
  
Inhibitor
Name:
BDBM50054564
Synonyms:
(Z)-2-Cyano-3-cyclopropyl-N-(3-ethyl-4-trifluoromethyl-phenyl)-3-hydroxy-acrylamide | CHEMBL357459
Type:
Small organic molecule
Emp. Form.:
C16H15F3N2O2
Mol. Mass.:
324.2977
SMILES:
CCc1cc(NC(=O)C(C#N)C(=O)C2CC2)ccc1C(F)(F)F
: