Target
Dihydroorotate dehydrogenase (quinone), mitochondrial
Ligand
BDBM50054584
Substrate
Meas. Tech.
ChEMBL_52874 (CHEMBL666233)
IC50
63±n/a nM
Citation
 Kuo, EAHambleton, PTKay, DPEvans, PLMatharu, SSLittle, EMcDowall, NJones, CBHedgecock, CJYea, CMChan, AWHairsine, PWAger, IRTully, WRWilliamson, RAWestwood, R Synthesis, structure-activity relationships, and pharmacokinetic properties of dihydroorotate dehydrogenase inhibitors: 2-cyano-3-cyclopropyl-3-hydroxy-N-[3'-methyl-4'-(trifluoromethyl)phenyl ] propenamide and related compounds. J Med Chem 39:4608-21 (1996)  
Target
Name:
Dihydroorotate dehydrogenase (quinone), mitochondrial
Synonyms:
DHOdehase Dihydroorotate Dehydrogenase (DHODH) Dihydroorotate oxidase | PYRD_RAT
Type:
Enzyme
Mol. Mass.:
42672.97
Organism:
Rattus norvegicus (rat)
Description:
The enzyme assay was performed with the histidine-tagged enzyme without cleavage of the tag.
Residue:
395
  
Inhibitor
Name:
BDBM50054584
Synonyms:
(Z)-N-(4-Chloro-phenyl)-2-cyano-3-cyclopropyl-3-hydroxy-acrylamide | CHEMBL143518
Type:
Small organic molecule
Emp. Form.:
C13H11ClN2O2
Mol. Mass.:
262.692
SMILES:
Clc1ccc(NC(=O)C(C#N)C(=O)C2CC2)cc1
: