Target
Dihydroorotate dehydrogenase (quinone), mitochondrial
Ligand
BDBM50054601
Substrate
Meas. Tech.
ChEMBL_52874 (CHEMBL666233)
IC50
9±n/a nM
Citation
 Kuo, EAHambleton, PTKay, DPEvans, PLMatharu, SSLittle, EMcDowall, NJones, CBHedgecock, CJYea, CMChan, AWHairsine, PWAger, IRTully, WRWilliamson, RAWestwood, R Synthesis, structure-activity relationships, and pharmacokinetic properties of dihydroorotate dehydrogenase inhibitors: 2-cyano-3-cyclopropyl-3-hydroxy-N-[3'-methyl-4'-(trifluoromethyl)phenyl ] propenamide and related compounds. J Med Chem 39:4608-21 (1996)  
Target
Name:
Dihydroorotate dehydrogenase (quinone), mitochondrial
Synonyms:
DHOdehase Dihydroorotate Dehydrogenase (DHODH) Dihydroorotate oxidase | PYRD_RAT
Type:
Enzyme
Mol. Mass.:
42672.97
Organism:
Rattus norvegicus (rat)
Description:
The enzyme assay was performed with the histidine-tagged enzyme without cleavage of the tag.
Residue:
395
  
Inhibitor
Name:
BDBM50054601
Synonyms:
5-Methyl-N-(4-(trifluoromethyl)phenyl)-4-isoxazolecarboxamide 5-methyl-N-[4-(trifluoromethyl)phenyl]-1,2-oxazole-4-carboxamide CHEMBL960 alpha,alpha,alpha-Trifluoro-5-methyl-4-isoxazolecarboxy-p-toluidide
Type:
Small organic molecule
Emp. Form.:
C12H9F3N2O2
Mol. Mass.:
270.2073
SMILES:
Cc1oncc1C(=O)Nc1ccc(cc1)C(F)(F)F
: