Target
Dihydroorotate dehydrogenase (quinone), mitochondrial
Ligand
BDBM50054552
Substrate
Meas. Tech.
ChEMBL_52874 (CHEMBL666233)
IC50
13±n/a nM
Citation
 Kuo, EAHambleton, PTKay, DPEvans, PLMatharu, SSLittle, EMcDowall, NJones, CBHedgecock, CJYea, CMChan, AWHairsine, PWAger, IRTully, WRWilliamson, RAWestwood, R Synthesis, structure-activity relationships, and pharmacokinetic properties of dihydroorotate dehydrogenase inhibitors: 2-cyano-3-cyclopropyl-3-hydroxy-N-[3'-methyl-4'-(trifluoromethyl)phenyl ] propenamide and related compounds. J Med Chem 39:4608-21 (1996)  
Target
Name:
Dihydroorotate dehydrogenase (quinone), mitochondrial
Synonyms:
DHOdehase Dihydroorotate Dehydrogenase (DHODH) Dihydroorotate oxidase | PYRD_RAT
Type:
Enzyme
Mol. Mass.:
42672.97
Organism:
Rattus norvegicus (rat)
Description:
The enzyme assay was performed with the histidine-tagged enzyme without cleavage of the tag.
Residue:
395
  
Inhibitor
Name:
BDBM50054552
Synonyms:
(Z)-2-Cyano-3-cyclopropyl-3-hydroxy-N-(4-methylsulfanyl-phenyl)-acrylamide | CHEMBL143816
Type:
Small organic molecule
Emp. Form.:
C14H14N2O2S
Mol. Mass.:
274.338
SMILES:
CSc1ccc(NC(=O)C(C#N)C(=O)C2CC2)cc1
: