Target
Dihydroorotate dehydrogenase (quinone), mitochondrial
Ligand
BDBM50054548
Substrate
Meas. Tech.
ChEMBL_52873 (CHEMBL666232)
IC50
36±n/a nM
Citation
 Kuo, EAHambleton, PTKay, DPEvans, PLMatharu, SSLittle, EMcDowall, NJones, CBHedgecock, CJYea, CMChan, AWHairsine, PWAger, IRTully, WRWilliamson, RAWestwood, R Synthesis, structure-activity relationships, and pharmacokinetic properties of dihydroorotate dehydrogenase inhibitors: 2-cyano-3-cyclopropyl-3-hydroxy-N-[3'-methyl-4'-(trifluoromethyl)phenyl ] propenamide and related compounds. J Med Chem 39:4608-21 (1996)  
Target
Name:
Dihydroorotate dehydrogenase (quinone), mitochondrial
Synonyms:
Dhodh PYRD_MOUSE
Type:
PROTEIN
Mol. Mass.:
42711.08
Organism:
Mus musculus
Description:
ChEMBL_1366444
Residue:
395
  
Inhibitor
Name:
BDBM50054548
Synonyms:
(Z)-N-(4-Bromo-phenyl)-2-cyano-3-cyclopropyl-3-hydroxy-acrylamide | CHEMBL142214
Type:
Small organic molecule
Emp. Form.:
C13H11BrN2O2
Mol. Mass.:
307.143
SMILES:
Brc1ccc(NC(=O)C(C#N)C(=O)C2CC2)cc1
: