Target
Dihydroorotate dehydrogenase (quinone), mitochondrial
Ligand
BDBM14712
Substrate
Meas. Tech.
ChEMBL_52873 (CHEMBL666232)
IC50
69±n/a nM
Citation
 Kuo, EAHambleton, PTKay, DPEvans, PLMatharu, SSLittle, EMcDowall, NJones, CBHedgecock, CJYea, CMChan, AWHairsine, PWAger, IRTully, WRWilliamson, RAWestwood, R Synthesis, structure-activity relationships, and pharmacokinetic properties of dihydroorotate dehydrogenase inhibitors: 2-cyano-3-cyclopropyl-3-hydroxy-N-[3'-methyl-4'-(trifluoromethyl)phenyl ] propenamide and related compounds. J Med Chem 39:4608-21 (1996)  
Target
Name:
Dihydroorotate dehydrogenase (quinone), mitochondrial
Synonyms:
Dhodh PYRD_MOUSE
Type:
PROTEIN
Mol. Mass.:
42711.08
Organism:
Mus musculus
Description:
ChEMBL_1366444
Residue:
395
  
Inhibitor
Name:
BDBM14712
Synonyms:
(2Z)-2-cyano-3-hydroxy-N-[4-(trifluoromethyl)phenyl]but-2-enamide CHEMBL973 TERIFLUNOMIDE
Type:
Small organic molecule
Emp. Form.:
C12H9F3N2O2
Mol. Mass.:
270.2073
SMILES:
CC(=O)C(C#N)C(=O)Nc1ccc(cc1)C(F)(F)F
: