Target
Thymidine kinase
Ligand
BDBM50366681
Substrate
Meas. Tech.
ChEMBL_208012 (CHEMBL816092)
IC50
300±n/a nM
Citation
 De Winter, HHerdewijn, P Understanding the binding of 5-substituted 2'-deoxyuridine substrates to thymidine kinase of herpes simplex virus type-1. J Med Chem 39:4727-37 (1997)  
Target
Name:
Thymidine kinase
Synonyms:
KITH_HHV1S Thymidine kinase | UL23
Type:
PROTEIN
Mol. Mass.:
40883.42
Organism:
Human herpesvirus 1 (strain SC16) (HHV-1) (Human herpes simplex virus1)
Description:
ChEMBL_213
Residue:
376
  
Inhibitor
Name:
BDBM50366681
Synonyms:
BRIVUDINE Bridic Brivudin Helpin Zonavir | Zostex
Type:
Small organic molecule
Emp. Form.:
C11H13BrN2O5
Mol. Mass.:
333.135
SMILES:
OC[C@H]1O[C@H](C[C@@H]1O)n1cc(C=CBr)c(=O)[nH]c1=O
: