Target
Sodium-dependent dopamine transporter
Ligand
BDBM50054782
Substrate
Meas. Tech.
ChEMBL_62655 (CHEMBL679190)
Ki
3970±n/a nM
Citation
 Chen, ZIzenwasser, SKatz, JLZhu, NKlein, CLTrudell, ML Synthesis and dopamine transporter affinity of 2-(methoxycarbonyl)-9-methyl-3-phenyl-9-azabicyclo[3.3.1]nonane derivatives. J Med Chem 39:4744-9 (1997)  
Target
Name:
Sodium-dependent dopamine transporter
Synonyms:
DA transporter SC6A3_RAT Sodium-dependent dopamine transporter | Sodium-dependent dopamine transporter (DAT)
Type:
Multi-pass membrane protein
Mol. Mass.:
68749.45
Organism:
Rattus norvegicus (rat)
Description:
P23977
Residue:
619
  
Inhibitor
Name:
BDBM50054782
Synonyms:
(9-Methyl-3-phenyl-9-aza-bicyclo[3.3.1]non-2-yl)-phenyl-methanone | CHEMBL358553
Type:
Small organic molecule
Emp. Form.:
C22H25NO
Mol. Mass.:
319.44
SMILES:
CN1C2CCCC1C(C(C2)c1ccccc1)C(=O)c1ccccc1
: