Target
Sodium-dependent dopamine transporter
Ligand
BDBM50054783
Substrate
Meas. Tech.
ChEMBL_62654 (CHEMBL679189)
Ki
5730±n/a nM
Citation
 Chen, ZIzenwasser, SKatz, JLZhu, NKlein, CLTrudell, ML Synthesis and dopamine transporter affinity of 2-(methoxycarbonyl)-9-methyl-3-phenyl-9-azabicyclo[3.3.1]nonane derivatives. J Med Chem 39:4744-9 (1997)  
Target
Name:
Sodium-dependent dopamine transporter
Synonyms:
DA transporter SC6A3_RAT Sodium-dependent dopamine transporter | Sodium-dependent dopamine transporter (DAT)
Type:
Multi-pass membrane protein
Mol. Mass.:
68749.45
Organism:
Rattus norvegicus (rat)
Description:
P23977
Residue:
619
  
Inhibitor
Name:
BDBM50054783
Synonyms:
9-Methyl-3-phenyl-9-aza-bicyclo[3.3.1]nonane-2-carboxylic acid methyl ester | CHEMBL142744
Type:
Small organic molecule
Emp. Form.:
C17H23NO2
Mol. Mass.:
273.37
SMILES:
COC(=O)C1C2CCCC(CC1c1ccccc1)N2C
: