Target
Sodium-dependent dopamine transporter
Ligand
BDBM50366564
Substrate
Meas. Tech.
ChEMBL_62656 (CHEMBL679191)
Ki
33±n/a nM
Citation
 Chen, ZIzenwasser, SKatz, JLZhu, NKlein, CLTrudell, ML Synthesis and dopamine transporter affinity of 2-(methoxycarbonyl)-9-methyl-3-phenyl-9-azabicyclo[3.3.1]nonane derivatives. J Med Chem 39:4744-9 (1997)  
Target
Name:
Sodium-dependent dopamine transporter
Synonyms:
DA transporter SC6A3_RAT Sodium-dependent dopamine transporter | Sodium-dependent dopamine transporter (DAT)
Type:
Multi-pass membrane protein
Mol. Mass.:
68749.45
Organism:
Rattus norvegicus (rat)
Description:
P23977
Residue:
619
  
Inhibitor
Name:
BDBM50366564
Synonyms:
CHEMBL1790051 WIN-35065-2
Type:
Small organic molecule
Emp. Form.:
C16H21NO2
Mol. Mass.:
259.3434
SMILES:
COC(=O)[C@@H]1C2CC[C@H](C[C@@H]1c1ccccc1)N2C
: