Target
Sodium-dependent dopamine transporter
Ligand
BDBM50054784
Substrate
Meas. Tech.
ChEMBL_62339 (CHEMBL674431)
Ki
>100000±n/a nM
Citation
 Chen, ZIzenwasser, SKatz, JLZhu, NKlein, CLTrudell, ML Synthesis and dopamine transporter affinity of 2-(methoxycarbonyl)-9-methyl-3-phenyl-9-azabicyclo[3.3.1]nonane derivatives. J Med Chem 39:4744-9 (1997)  
Target
Name:
Sodium-dependent dopamine transporter
Synonyms:
DA transporter SC6A3_RAT Sodium-dependent dopamine transporter | Sodium-dependent dopamine transporter (DAT)
Type:
Multi-pass membrane protein
Mol. Mass.:
68749.45
Organism:
Rattus norvegicus (rat)
Description:
P23977
Residue:
619
  
Inhibitor
Name:
BDBM50054784
Synonyms:
3-Hydroxy-10-methyl-10-aza-bicyclo[4.3.1]dec-2-ene-2-carboxylic acid methyl ester | CHEMBL142742
Type:
Small organic molecule
Emp. Form.:
C12H19NO3
Mol. Mass.:
225.2842
SMILES:
COC(=O)C1C2CCCC(CCC1=O)N2C
: