Target
Phospholipase A2, membrane associated
Ligand
BDBM50055431
Substrate
Meas. Tech.
ChEMBL_156362 (CHEMBL761692)
IC50
42000±n/a nM
Citation
 Teshirogi, IMatsutani, SShirahase, KFujii, YYoshida, TTanaka, KOhtani, M Synthesis and phospholipase A2 inhibitory activity of thielocin B3 derivatives. J Med Chem 39:5183-91 (1997)  
Target
Name:
Phospholipase A2, membrane associated
Synonyms:
PA2GA_RAT Pla2g2a
Type:
PROTEIN
Mol. Mass.:
16307.95
Organism:
Rattus norvegicus
Description:
ChEMBL_537135
Residue:
146
  
Inhibitor
Name:
BDBM50055431
Synonyms:
Bis[3-[[4-[(4-carboxy-3-methoxy-2,5,6-trimethylphenoxy)carbonyl]-3-methoxy-2,5,6-triimethylphenoxy]carbonyl]-4-methoxyphenyl]ether | CHEMBL409657
Type:
Small organic molecule
Emp. Form.:
C60H62O19
Mol. Mass.:
1087.1229
SMILES:
COc1ccc(Oc2ccc(OC)c(c2)C(=O)Oc2c(C)c(C)c(C(=O)Oc3c(C)c(C)c(C(O)=O)c(OC)c3C)c(OC)c2C)cc1C(=O)Oc1c(C)c(C)c(C(=O)Oc2c(C)c(C)c(C(O)=O)c(OC)c2C)c(OC)c1C
: