Target
Polyunsaturated fatty acid 5-lipoxygenase
Ligand
BDBM50058610
Substrate
Meas. Tech.
ChEMBL_90070 (CHEMBL701321)
IC50
3400±n/a nM
Citation
 Stewart, AOBhatia, PAMartin, JGSummers, JBRodriques, KEMartin, MBHolms, JHMoore, JLCraig, RAKolasa, TRatajczyk, JDMazdiyasni, HKerdesky, FADeNinno, SLMaki, RGBouska, JBYoung, PRLanni, CBell, RLCarter, GWBrooks, CD Structure-activity relationships of N-hydroxyurea 5-lipoxygenase inhibitors. J Med Chem 40:1955-68 (1997)  
Target
Name:
Polyunsaturated fatty acid 5-lipoxygenase
Synonyms:
5-LO 5-Lipoxygenase (5-LO) 5-Lipoygenase ALOX5 LOG5 | LOX5_HUMAN
Type:
Enzyme
Mol. Mass.:
77972.74
Organism:
Homo sapiens (Human)
Description:
Recombinant protein was purified from E. coli lysate. After ammonium sulfate precipitation and subsequent steps, the supernatant (S100) was used for 5-LO activity assay.
Residue:
674
  
Inhibitor
Name:
BDBM50058610
Synonyms:
CHEMBL61980 | N-hydroxy-N-[1-(5-pyridin-2-yl-2-furyl)ethyl]urea
Type:
Small organic molecule
Emp. Form.:
C12H13N3O3
Mol. Mass.:
247.2499
SMILES:
CC(N(O)C(N)=O)c1ccc(o1)-c1ccccn1
: