Target
Polyunsaturated fatty acid 5-lipoxygenase
Ligand
BDBM50058610
Substrate
Meas. Tech.
ChEMBL_4202 (CHEMBL620004)
IC50
6400±n/a nM
Citation
 Stewart, AOBhatia, PAMartin, JGSummers, JBRodriques, KEMartin, MBHolms, JHMoore, JLCraig, RAKolasa, TRatajczyk, JDMazdiyasni, HKerdesky, FADeNinno, SLMaki, RGBouska, JBYoung, PRLanni, CBell, RLCarter, GWBrooks, CD Structure-activity relationships of N-hydroxyurea 5-lipoxygenase inhibitors. J Med Chem 40:1955-68 (1997)  
Target
Name:
Polyunsaturated fatty acid 5-lipoxygenase
Synonyms:
Alox5 LOX5_RAT
Type:
PROTEIN
Mol. Mass.:
78082.31
Organism:
Rattus norvegicus
Description:
ChEMBL_1432947
Residue:
673
  
Inhibitor
Name:
BDBM50058610
Synonyms:
CHEMBL61980 | N-hydroxy-N-[1-(5-pyridin-2-yl-2-furyl)ethyl]urea
Type:
Small organic molecule
Emp. Form.:
C12H13N3O3
Mol. Mass.:
247.2499
SMILES:
CC(N(O)C(N)=O)c1ccc(o1)-c1ccccn1
: